�S���n�������c�̃R�[�h,ID,�n�������c�̖�,����,�ǂ݉����i�J�i�j,����_�p��,����_�ʏ�,POI�R�[�h,�O�����ʎq,�O�����ʎq�̒l,���ݒn_�S���n�������c�̃R�[�h,����ID,���ݒn_�A���\�L,���ݒn_�s���{��,���ݒn_�s�撬��,���ݒn_����,���ݒn_�Ԓn�ȉ�,��������(����),�ܓx,�o�x,���x�̎��,���x�̒l,�d�b�ԍ�,�����ԍ�,�d�b�ԍ����ӏ���,�A���惁�[���A�h���X,�A����FormURL,�A������l�i���̑��ASNS�Ȃǁj,�X�֔ԍ�,�@�l�ԍ�,�c�̖��i�{�݊Ǘ��c�́j,���p�\�j��,��x��,��x���ڍ�,�J�n����,�I������,���p�\���ԓ��L����,����,�����i��{�j,�����i�ڍׁj,��ʃA�N�Z�X,�߂��̉w�i�R�܂Łj,�w����߂��i1���L�A0�����j,���ԏꂠ��i1���L�A0�����j,���ԏꗿ��,���ԉ\�䐔,���ԏ�ڍ�,�Ԉ֎q��,�Ԉ֎q�ݏo,�c�G�ݏo,�o���A�t���[���o���A�t���[�g�C��,�X���[�v�A�G���x�[�^�A�G�X�J���[�^,�_���u���b�N���̈ړ��x��,�_����Ǐ�ɂ��x��,�ӓ����E����A����������,����,�M�k�Ή�,�D�撓�ԏ�,�I�X�g���C�g�Ή��g�C��,����������i1���L�A0�����j,�I���c������i1���L�A0�����j,�H����������OK�i1��OK�A0��NG�j,�x�r�[�J�[�ݏo,�x�r�[�J�[OK�i1��OK�A0��NG�j,����������i1���L�A0�����j,���X�g��������i1���L�A0�����j,���X����i1���L�A0�����j,�J�ł�OK�i1��OK�A0��NG�j,URL,�摜,�摜_���C�Z���X,���l,�ŏI�X�V��
242098,,���h�s,�k�Y��������,�L�^�E���W�h�E�R�E�G��,,,,,,,,�O�d�����h�s�k�Y��7-7,�O�d��,���h�s,�k�Y��,7-7,,34.07699,136.19797,,,,,,,,,519-3606,,���h�s,���ΐ��؋��y��,,,,,,��������,,,,,0,0,,,,,,,,,,,,,,,,0,0,1,,1,0,0,0,,,,,,2024/3/8
242098,,���h�s,��n���w�O��������,�m�W�}�`�G�L�}�G�W�h�E�R�E�G��,,,,,,,,�O�d�����h�s��n��12-47,�O�d��,���h�s,��n��,12-47,,34.07544,136.19181,,,,,,,,,519-3617,,���h�s,���ΐ��؋��y��,,,,,,��������,,,���h�w���璼��������122m,,1,0,,,,,,,,,,,,,,,,0,0,1,,1,0,0,0,,,,,,2024/3/8
242098,,���h�s,�����R����,�i�J�������}�R�E�G��,,,,,,,,�O�d�����h�s������10,�O�d��,���h�s,������,10,,34.07201,136.19260,,,0597-23-8261,,,,,,519-3616,,���h�s,���ΐ��؋��y��,,,,,,��������,,,���h�w����k��10��,,1,0,,,,,,,,,,,,,,,,0,0,1,,1,0,0,0,,,,,,2024/3/8
242098,,���h�s,�Ìˎ�������,�R�h�W�h�E�R�E�G��,,,,,,,,�O�d�����h�s�Ì˒�5-11,�O�d��,���h�s,�Ì˒�,5-11,,34.07190,136.18840,,,,,,,,,519-3652,,���h�s,���ΐ��؋��y��,,,,,,��������,,,���h�w����k��12��,,1,0,,,,,,,,,,,,,,,,0,0,1,,1,0,0,0,,,,,,2024/3/8
242098,,���h�s,��̕l����,���m�n�}�R�E�G��,,,,,,,,�O�d�����h�s��l1����27-13,�O�d��,���h�s,��l,1����27-13,,34.06238,136.20116,,,,,,,,,519-3671,,���h�s,���ΐ��؋��y��,,,,,,��������,,,,,0,0,,,,,,,,,,,,,,,,0,0,1,,1,0,0,0,,,,,,2024/3/8
242098,,���h�s,�����u��ꎙ������,�q�J���K�I�J�_�C�C�`�W�h�E�R�E�G��,,,,,,,,�O�d�����h�s�����u22-22,�O�d��,���h�s,�����u,22-22,,34.06473,136.17670,,,,,,,,,519-3637,,���h�s,���ΐ��؋��y��,,,,,,,,,,,0,0,,,,,,,,,,,,,,,,0,0,1,,1,0,0,0,,,,,,2024/3/8
242098,,���h�s,��ꎙ������,�I�I�^�L�W�h�E�R�E�G��,,,,,,,,�O�d�����h�s��꒬11-11,�O�d��,���h�s,��꒬,11-11,,34.06793,136.18453,,,,,,,,,519-3642,,���h�s,���ΐ��؋��y��,,,,,,,,,,,0,0,,,,,,,,,,,,,,,,0,0,1,,1,0,0,0,,,,,,2024/3/8
242098,,���h�s,���ꎙ������,�C�Y�~�_�C�C�`�W�h�E�R�E�G��,,,,,,,,�O�d�����h�s��14-14,�O�d��,���h�s,��,14-14,,34.06940,136.18215,,,,,,,,,519-3646,,���h�s,���ΐ��؋��y��,,,,,,,,,,,0,0,,,,,,,,,,,,,,,,0,0,1,,1,0,0,0,,,,,,2024/3/8
242098,,���h�s,�玙�T�[�N���@�͂��҂�,�C�N�W�T�[�N���@�n�b�s�B,,,,,,,,�O�d�����h�s�h��5-5,�O�d��,���h�s,�h��,5-5,�����ی��Z���^�[,34.07440,136.19527,,,0597-23-3871,,,,,,519-3618,,���h�s,���T���j��,�ΐ��؋��y��,�j���Əd�Ȃ������͂��x��,�ߑO10��,����,,,,,���h�w����k��7��,,1,1,,9,,,,,,,,����,,,,,,,,,,,,0,0,,,,,,2024/3/8
242098,,���h�s,�c�ۘA�g�^�F�肱�ǂ����@�Ђ̂��������ǂ���,���E�z�����P�C�K�^�j���e�C�R�h���G���@�q�m�L�b�R�R�h���G��,,,,,,,,�O�d�����h�s�Ì˒�5-15,�O�d��,���h�s,�Ì˒�,5-15,�Е�)���h�������Ƌ���@�c�ۘA�g�^�F�肱�ǂ����@�Ђ̂��������ǂ���,34.07237,136.18928,,,0597-22-4767,,,,,,519-3652,,�Е�)���h�������Ƌ���,���ΐ��؋�,�y��,�y�j���A���j���A�j���A�N���N�n,�ߑO9��,�ߑO11��,�뉀�J��,,,,���h�w����k��10��,,1,1,,5,,,,,,,,,,,,,,,,,,,,,,,,,,,2024/3/8
242098,,���h�s,�q��Ďx���Z���^�[�@���т����Ђ��,�R�\�_�e�V�G���Z���^�[�@�`�r�b�R�q���o,,,,,,,,�O�d�����h�s�{�m�㒬8-1,�O�d��,���h�s,�{�m�㒬,8-1,�Е�)���h�������Ƌ���@���h���ۈ牀,34.07980,136.19395,,,0597-23-2600,,,,,,519-3663,,�Е�)���h�������Ƌ���,���ΐ��؋�,�y��,�e�q�����J�Ó��A�y�j���A���j���A�j���A�N���N�n,�ߑO9���ƌߌ�1��,���߂ƌߌ�3��,�ӂꂠ���f�[�i�Z���^�[�J���j,,"�N��1,700�~",,���h�w����k��12��,,1,1,,17,,,,,,,,,,,,,,,,,,,,,,,,,,,2024/3/8
242098,,���h�s,���h�s���}����,�I���Z�V���c�g�V���J��,,,,,,,,�O�d�����h�s������10-41,�O�d��,���h�s,������,10-41,����������,34.07156,136.19206,,,0597-22-0001,,,,,,519-3616,,���h�s,�ΐ��؋��y��,��,���j���i�j���̏ꍇ�́A���̒���̕����j�A�����������A�N���N�n�A���ʐ�����,�ߑO9��30��,�ߌ�7��,�y���j�͌ߑO9��30���`�ߌ�5��,,,,���h�w����k��10��,,1,1,,25,���������ق̒��ԏ�,,,,,�G���x�[�^�[,,,,,,,,,,,,1,0,0,0,,,,,,2024/3/8
242098,,���h�s,���h�s���V���Ȋw��,�I���Z�V���c�e�������J�K�N�J��,,,,,,,,�O�d�����h�s������10-41,�O�d��,���h�s,������,10-41,�V���Ȋw��,34.07239,136.19316,,,0597-23-0525,,,,,,519-3616,,���h�s,���E�y�E���j��,,,�ߑO9��30��,�ߌ�5��,���E�y�j�̂ݖ�Ԍߌ�7���`�ߌ�9��30��,,,��l200�~�A������100�~�A���w��50�~,���h�w����k��10��,,1,1,,25,���������ق̒��ԏ�,,,,,,,,,,,,,0,,,,1,0,0,0,,,,,,2024/3/8
